{"text_format":"1","workbook":"xlsx","n_sheets":6,"sheets":["查询","新旧计划","专业","计划","课程代码","Sheet1"],"not_rendered":{"charts":0,"images":2,"macros":1,"external_links":0,"defined_names":9,"comments":0,"pivot_tables":0},"unopened":[],"bounds":{"document_bytes":16777216,"sheet_cells":100000,"rows_first":2000,"rows_last":500,"rows_between":2000,"halvings":0,"cell_chars":16384,"cell_head_chars":4096},"cells_cut":0,"cells_raw":0,"read":"whole","date_system":"1900"}

{"sheet":"查询","index":0,"n_rows":43,"n_cols":14,"rows_kept":43,"cut":false,"hidden":false,"merged":[[42,5,42,7],[2,13,3,13],[7,13,40,13],[0,14,2,14],[1,6,1,7],[1,8,1,9],[0,0,0,9],[3,6,3,7],[40,0,40,4],[41,0,41,9]]}
["湖 南 省 自 学 考 试 专 业 计 划 成 绩 查 询 单"]
[{"$f":"IF(P2<>\"\",P2,\"\")","v":""},null,null,null,null,"专业代码：",{"$f":"$N$5","v":""},null,{"$f":"IFERROR(VLOOKUP(N$5,计划!C:F,2,0),\"\")","v":""}]
[{"$f":"IF(P3<>\"\",P3,\"\")","v":""},null,null,null,null,null,null,null,null,null,null,null,null,"↓ 请选择专业 ↓"]
["序号","课程代码","课程名称","国省","学分","通过时间","成绩已得学分",null,"替代","备注"]
["01",{"$f":"IFERROR(VLOOKUP(N$5&A5,计划!B:E,4,0),\"\")","v":""},{"$f":"IFERROR(VLOOKUP(N$5&A5,计划!B:F,5,0),\"\")","v":""},{"$f":"IFERROR(VLOOKUP(B5,课程代码!B:E,4,0),\"\")","v":""},{"$f":"IFERROR(VLOOKUP($N$5&A5,计划!B:G,6,0),\"\")","v":""},{"$f":"IFERROR(VLOOKUP(B5,IF({1,0},R:R,Q:Q),2,0),\"\")","v":""},{"$f":"IFERROR(VLOOKUP(B5,R:T,3,0),\"\")","v":""},{"$f":"IFERROR(IF(G5<>\"\",VLOOKUP($N$5&A5,计划!B:G,6,0),\"\")&\" \"&IF(I5<>\"\",VLOOKUP($N$5&A5,计划!B:G,6,0),\"\"),\"\")","v":" "},{"$f":"IFERROR(VLOOKUP(K5,R:T,3,0),\"\")&IFERROR(VLOOKUP(L5,R:T,3,0),\"\")&IFERROR(VLOOKUP(M5,R:T,3,0),\"\")","v":""},{"$f":"IF(IFERROR(VLOOKUP(N$5&A5,计划!B:H,7,0),\"\")=0,\"\",IFERROR(VLOOKUP(N$5&A5,计划!B:H,7,0),\"\"))","v":""},{"$f":"IF(IFERROR(VLOOKUP($N$5&A5,计划!B:I,8,0),\"\")=0,\"\",IFERROR(VLOOKUP($N$5&A5,计划!B:I,8,0),\"\"))","v":""},{"$f":"IF(IFERROR(VLOOKUP($N$5&A5,计划!B:J,9,0),\"\")=0,\"\",IFERROR(VLOOKUP($N$5&A5,计划!B:J,9,0),\"\"))","v":""},{"$f":"IF(IFERROR(VLOOKUP($N$5&A5,计划!B:K,10,0),\"\")=0,\"\",IFERROR(VLOOKUP($N$5&A5,计划!B:K,10,0),\"\"))","v":""},{"$f":"IF(VLOOKUP(N6,专业!C:F,4,0)=\"专业代码\",\"\",VLOOKUP(N6,专业!C:F,4,0))","v":""}]
["02",{"$f":"IFERROR(VLOOKUP(N$5&A6,计划!B:E,4,0),\"\")","v":""},{"$f":"IFERROR(VLOOKUP(N$5&A6,计划!B:F,5,0),\"\")","v":""},{"$f":"IFERROR(VLOOKUP(B6,课程代码!B:E,4,0),\"\")","v":""},{"$f":"IFERROR(VLOOKUP($N$5&A6,计划!B:G,6,0),\"\")","v":""},{"$f":"IFERROR(VLOOKUP(B6,IF({1,0},R:R,Q:Q),2,0),\"\")","v":""},{"$f":"IFERROR(VLOOKUP(B6,R:T,3,0),\"\")","v":""},{"$f":"IFERROR(IF(G6<>\"\",VLOOKUP($N$5&A6,计划!B:G,6,0),\"\")&\" \"&IF(I6<>\"\",VLOOKUP($N$5&A6,计划!B:G,6,0),\"\"),\"\")","v":" "},{"$f":"IFERROR(VLOOKUP(K6,R:T,3,0),\"\")&IFERROR(VLOOKUP(L6,R:T,3,0),\"\")&IFERROR(VLOOKUP(M6,R:T,3,0),\"\")","v":""},{"$f":"IF(IFERROR(VLOOKUP(N$5&A6,计划!B:H,7,0),\"\")=0,\"\",IFERROR(VLOOKUP(N$5&A6,计划!B:H,7,0),\"\"))","v":""},{"$f":"IF(IFERROR(VLOOKUP($N$5&A6,计划!B:I,8,0),\"\")=0,\"\",IFERROR(VLOOKUP($N$5&A6,计划!B:I,8,0),\"\"))","v":""},{"$f":"IF(IFERROR(VLOOKUP($N$5&A6,计划!B:J,9,0),\"\")=0,\"\",IFERROR(VLOOKUP($N$5&A6,计划!B:J,9,0),\"\"))","v":""},{"$f":"IF(IFERROR(VLOOKUP($N$5&A6,计划!B:K,10,0),\"\")=0,\"\",IFERROR(VLOOKUP($N$5&A6,计划!B:K,10,0),\"\"))","v":""},"专业名称"]
["03",{"$f":"IFERROR(VLOOKUP(N$5&A7,计划!B:E,4,0),\"\")","v":""},{"$f":"IFERROR(VLOOKUP(N$5&A7,计划!B:F,5,0),\"\")","v":""},{"$f":"IFERROR(VLOOKUP(B7,课程代码!B:E,4,0),\"\")","v":""},{"$f":"IFERROR(VLOOKUP($N$5&A7,计划!B:G,6,0),\"\")","v":""},{"$f":"IFERROR(VLOOKUP(B7,IF({1,0},R:R,Q:Q),2,0),\"\")","v":""},"",{"$f":"IFERROR(IF(G7<>\"\",VLOOKUP($N$5&A7,计划!B:G,6,0),\"\")&\" \"&IF(I7<>\"\",VLOOKUP($N$5&A7,计划!B:G,6,0),\"\"),\"\")","v":" "},"",{"$f":"IF(IFERROR(VLOOKUP(N$5&A7,计划!B:H,7,0),\"\")=0,\"\",IFERROR(VLOOKUP(N$5&A7,计划!B:H,7,0),\"\"))","v":""},{"$f":"IF(IFERROR(VLOOKUP($N$5&A7,计划!B:I,8,0),\"\")=0,\"\",IFERROR(VLOOKUP($N$5&A7,计划!B:I,8,0),\"\"))","v":""},{"$f":"IF(IFERROR(VLOOKUP($N$5&A7,计划!B:J,9,0),\"\")=0,\"\",IFERROR(VLOOKUP($N$5&A7,计划!B:J,9,0),\"\"))","v":""},{"$f":"IF(IFERROR(VLOOKUP($N$5&A7,计划!B:K,10,0),\"\")=0,\"\",IFERROR(VLOOKUP($N$5&A7,计划!B:K,10,0),\"\"))","v":""}]
["04",{"$f":"IFERROR(VLOOKUP(N$5&A8,计划!B:E,4,0),\"\")","v":""},{"$f":"IFERROR(VLOOKUP(N$5&A8,计划!B:F,5,0),\"\")","v":""},{"$f":"IFERROR(VLOOKUP(B8,课程代码!B:E,4,0),\"\")","v":""},{"$f":"IFERROR(VLOOKUP($N$5&A8,计划!B:G,6,0),\"\")","v":""},{"$f":"IFERROR(VLOOKUP(B8,IF({1,0},R:R,Q:Q),2,0),\"\")","v":""},"",{"$f":"IFERROR(IF(G8<>\"\",VLOOKUP($N$5&A8,计划!B:G,6,0),\"\")&\" \"&IF(I8<>\"\",VLOOKUP($N$5&A8,计划!B:G,6,0),\"\"),\"\")","v":" "},"",{"$f":"IF(IFERROR(VLOOKUP(N$5&A8,计划!B:H,7,0),\"\")=0,\"\",IFERROR(VLOOKUP(N$5&A8,计划!B:H,7,0),\"\"))","v":""},{"$f":"IF(IFERROR(VLOOKUP($N$5&A8,计划!B:I,8,0),\"\")=0,\"\",IFERROR(VLOOKUP($N$5&A8,计划!B:I,8,0),\"\"))","v":""},{"$f":"IF(IFERROR(VLOOKUP($N$5&A8,计划!B:J,9,0),\"\")=0,\"\",IFERROR(VLOOKUP($N$5&A8,计划!B:J,9,0),\"\"))","v":""},{"$f":"IF(IFERROR(VLOOKUP($N$5&A8,计划!B:K,10,0),\"\")=0,\"\",IFERROR(VLOOKUP($N$5&A8,计划!B:K,10,0),\"\"))","v":""},"             查询说明\n\n1.在自考管理系统里查询成绩，点击打印，在下载的word中全选，复制。\n\n在本表的右边O1单元格处理（红框）\n\n粘贴(选择匹配目标格式，WPS选择无格式粘贴）。\n\n2.在上方专业名称处点击一下，出现下拉箭头，选择学生专业。\n\n3.左边的表格自动会显示学生专业计划成绩合格情况！\n\n"]
["05",{"$f":"IFERROR(VLOOKUP(N$5&A9,计划!B:E,4,0),\"\")","v":""},{"$f":"IFERROR(VLOOKUP(N$5&A9,计划!B:F,5,0),\"\")","v":""},{"$f":"IFERROR(VLOOKUP(B9,课程代码!B:E,4,0),\"\")","v":""},{"$f":"IFERROR(VLOOKUP($N$5&A9,计划!B:G,6,0),\"\")","v":""},{"$f":"IFERROR(VLOOKUP(B9,IF({1,0},R:R,Q:Q),2,0),\"\")","v":""},"",{"$f":"IFERROR(IF(G9<>\"\",VLOOKUP($N$5&A9,计划!B:G,6,0),\"\")&\" \"&IF(I9<>\"\",VLOOKUP($N$5&A9,计划!B:G,6,0),\"\"),\"\")","v":" "},"",{"$f":"IF(IFERROR(VLOOKUP(N$5&A9,计划!B:H,7,0),\"\")=0,\"\",IFERROR(VLOOKUP(N$5&A9,计划!B:H,7,0),\"\"))","v":""},{"$f":"IF(IFERROR(VLOOKUP($N$5&A9,计划!B:I,8,0),\"\")=0,\"\",IFERROR(VLOOKUP($N$5&A9,计划!B:I,8,0),\"\"))","v":""},{"$f":"IF(IFERROR(VLOOKUP($N$5&A9,计划!B:J,9,0),\"\")=0,\"\",IFERROR(VLOOKUP($N$5&A9,计划!B:J,9,0),\"\"))","v":""},{"$f":"IF(IFERROR(VLOOKUP($N$5&A9,计划!B:K,10,0),\"\")=0,\"\",IFERROR(VLOOKUP($N$5&A9,计划!B:K,10,0),\"\"))","v":""}]
["06",{"$f":"IFERROR(VLOOKUP(N$5&A10,计划!B:E,4,0),\"\")","v":""},{"$f":"IFERROR(VLOOKUP(N$5&A10,计划!B:F,5,0),\"\")","v":""},{"$f":"IFERROR(VLOOKUP(B10,课程代码!B:E,4,0),\"\")","v":""},{"$f":"IFERROR(VLOOKUP($N$5&A10,计划!B:G,6,0),\"\")","v":""},{"$f":"IFERROR(VLOOKUP(B10,IF({1,0},R:R,Q:Q),2,0),\"\")","v":""},"",{"$f":"IFERROR(IF(G10<>\"\",VLOOKUP($N$5&A10,计划!B:G,6,0),\"\")&\" \"&IF(I10<>\"\",VLOOKUP($N$5&A10,计划!B:G,6,0),\"\"),\"\")","v":" "},"",{"$f":"IF(IFERROR(VLOOKUP(N$5&A10,计划!B:H,7,0),\"\")=0,\"\",IFERROR(VLOOKUP(N$5&A10,计划!B:H,7,0),\"\"))","v":""},{"$f":"IF(IFERROR(VLOOKUP($N$5&A10,计划!B:I,8,0),\"\")=0,\"\",IFERROR(VLOOKUP($N$5&A10,计划!B:I,8,0),\"\"))","v":""},{"$f":"IF(IFERROR(VLOOKUP($N$5&A10,计划!B:J,9,0),\"\")=0,\"\",IFERROR(VLOOKUP($N$5&A10,计划!B:J,9,0),\"\"))","v":""},{"$f":"IF(IFERROR(VLOOKUP($N$5&A10,计划!B:K,10,0),\"\")=0,\"\",IFERROR(VLOOKUP($N$5&A10,计划!B:K,10,0),\"\"))","v":""}]
["07",{"$f":"IFERROR(VLOOKUP(N$5&A11,计划!B:E,4,0),\"\")","v":""},{"$f":"IFERROR(VLOOKUP(N$5&A11,计划!B:F,5,0),\"\")","v":""},{"$f":"IFERROR(VLOOKUP(B11,课程代码!B:E,4,0),\"\")","v":""},{"$f":"IFERROR(VLOOKUP($N$5&A11,计划!B:G,6,0),\"\")","v":""},{"$f":"IFERROR(VLOOKUP(B11,IF({1,0},R:R,Q:Q),2,0),\"\")","v":""},"",{"$f":"IFERROR(IF(G11<>\"\",VLOOKUP($N$5&A11,计划!B:G,6,0),\"\")&\" \"&IF(I11<>\"\",VLOOKUP($N$5&A11,计划!B:G,6,0),\"\"),\"\")","v":" "},"",{"$f":"IF(IFERROR(VLOOKUP(N$5&A11,计划!B:H,7,0),\"\")=0,\"\",IFERROR(VLOOKUP(N$5&A11,计划!B:H,7,0),\"\"))","v":""},{"$f":"IF(IFERROR(VLOOKUP($N$5&A11,计划!B:I,8,0),\"\")=0,\"\",IFERROR(VLOOKUP($N$5&A11,计划!B:I,8,0),\"\"))","v":""},{"$f":"IF(IFERROR(VLOOKUP($N$5&A11,计划!B:J,9,0),\"\")=0,\"\",IFERROR(VLOOKUP($N$5&A11,计划!B:J,9,0),\"\"))","v":""},{"$f":"IF(IFERROR(VLOOKUP($N$5&A11,计划!B:K,10,0),\"\")=0,\"\",IFERROR(VLOOKUP($N$5&A11,计划!B:K,10,0),\"\"))","v":""}]
["08",{"$f":"IFERROR(VLOOKUP(N$5&A12,计划!B:E,4,0),\"\")","v":""},{"$f":"IFERROR(VLOOKUP(N$5&A12,计划!B:F,5,0),\"\")","v":""},{"$f":"IFERROR(VLOOKUP(B12,课程代码!B:E,4,0),\"\")","v":""},{"$f":"IFERROR(VLOOKUP($N$5&A12,计划!B:G,6,0),\"\")","v":""},{"$f":"IFERROR(VLOOKUP(B12,IF({1,0},R:R,Q:Q),2,0),\"\")","v":""},"",{"$f":"IFERROR(IF(G12<>\"\",VLOOKUP($N$5&A12,计划!B:G,6,0),\"\")&\" \"&IF(I12<>\"\",VLOOKUP($N$5&A12,计划!B:G,6,0),\"\"),\"\")","v":" "},"",{"$f":"IF(IFERROR(VLOOKUP(N$5&A12,计划!B:H,7,0),\"\")=0,\"\",IFERROR(VLOOKUP(N$5&A12,计划!B:H,7,0),\"\"))","v":""},{"$f":"IF(IFERROR(VLOOKUP($N$5&A12,计划!B:I,8,0),\"\")=0,\"\",IFERROR(VLOOKUP($N$5&A12,计划!B:I,8,0),\"\"))","v":""},{"$f":"IF(IFERROR(VLOOKUP($N$5&A12,计划!B:J,9,0),\"\")=0,\"\",IFERROR(VLOOKUP($N$5&A12,计划!B:J,9,0),\"\"))","v":""},{"$f":"IF(IFERROR(VLOOKUP($N$5&A12,计划!B:K,10,0),\"\")=0,\"\",IFERROR(VLOOKUP($N$5&A12,计划!B:K,10,0),\"\"))","v":""}]
["09",{"$f":"IFERROR(VLOOKUP(N$5&A13,计划!B:E,4,0),\"\")","v":""},{"$f":"IFERROR(VLOOKUP(N$5&A13,计划!B:F,5,0),\"\")","v":""},{"$f":"IFERROR(VLOOKUP(B13,课程代码!B:E,4,0),\"\")","v":""},{"$f":"IFERROR(VLOOKUP($N$5&A13,计划!B:G,6,0),\"\")","v":""},{"$f":"IFERROR(VLOOKUP(B13,IF({1,0},R:R,Q:Q),2,0),\"\")","v":""},"",{"$f":"IFERROR(IF(G13<>\"\",VLOOKUP($N$5&A13,计划!B:G,6,0),\"\")&\" \"&IF(I13<>\"\",VLOOKUP($N$5&A13,计划!B:G,6,0),\"\"),\"\")","v":" "},"",{"$f":"IF(IFERROR(VLOOKUP(N$5&A13,计划!B:H,7,0),\"\")=0,\"\",IFERROR(VLOOKUP(N$5&A13,计划!B:H,7,0),\"\"))","v":""},{"$f":"IF(IFERROR(VLOOKUP($N$5&A13,计划!B:I,8,0),\"\")=0,\"\",IFERROR(VLOOKUP($N$5&A13,计划!B:I,8,0),\"\"))","v":""},{"$f":"IF(IFERROR(VLOOKUP($N$5&A13,计划!B:J,9,0),\"\")=0,\"\",IFERROR(VLOOKUP($N$5&A13,计划!B:J,9,0),\"\"))","v":""},{"$f":"IF(IFERROR(VLOOKUP($N$5&A13,计划!B:K,10,0),\"\")=0,\"\",IFERROR(VLOOKUP($N$5&A13,计划!B:K,10,0),\"\"))","v":""}]
["10",{"$f":"IFERROR(VLOOKUP(N$5&A14,计划!B:E,4,0),\"\")","v":""},{"$f":"IFERROR(VLOOKUP(N$5&A14,计划!B:F,5,0),\"\")","v":""},{"$f":"IFERROR(VLOOKUP(B14,课程代码!B:E,4,0),\"\")","v":""},{"$f":"IFERROR(VLOOKUP($N$5&A14,计划!B:G,6,0),\"\")","v":""},{"$f":"IFERROR(VLOOKUP(B14,IF({1,0},R:R,Q:Q),2,0),\"\")","v":""},"",{"$f":"IFERROR(IF(G14<>\"\",VLOOKUP($N$5&A14,计划!B:G,6,0),\"\")&\" \"&IF(I14<>\"\",VLOOKUP($N$5&A14,计划!B:G,6,0),\"\"),\"\")","v":" "},"",{"$f":"IF(IFERROR(VLOOKUP(N$5&A14,计划!B:H,7,0),\"\")=0,\"\",IFERROR(VLOOKUP(N$5&A14,计划!B:H,7,0),\"\"))","v":""},{"$f":"IF(IFERROR(VLOOKUP($N$5&A14,计划!B:I,8,0),\"\")=0,\"\",IFERROR(VLOOKUP($N$5&A14,计划!B:I,8,0),\"\"))","v":""},{"$f":"IF(IFERROR(VLOOKUP($N$5&A14,计划!B:J,9,0),\"\")=0,\"\",IFERROR(VLOOKUP($N$5&A14,计划!B:J,9,0),\"\"))","v":""},{"$f":"IF(IFERROR(VLOOKUP($N$5&A14,计划!B:K,10,0),\"\")=0,\"\",IFERROR(VLOOKUP($N$5&A14,计划!B:K,10,0),\"\"))","v":""}]
["11",{"$f":"IFERROR(VLOOKUP(N$5&A15,计划!B:E,4,0),\"\")","v":""},{"$f":"IFERROR(VLOOKUP(N$5&A15,计划!B:F,5,0),\"\")","v":""},{"$f":"IFERROR(VLOOKUP(B15,课程代码!B:E,4,0),\"\")","v":""},{"$f":"IFERROR(VLOOKUP($N$5&A15,计划!B:G,6,0),\"\")","v":""},{"$f":"IFERROR(VLOOKUP(B15,IF({1,0},R:R,Q:Q),2,0),\"\")","v":""},"",{"$f":"IFERROR(IF(G15<>\"\",VLOOKUP($N$5&A15,计划!B:G,6,0),\"\")&\" \"&IF(I15<>\"\",VLOOKUP($N$5&A15,计划!B:G,6,0),\"\"),\"\")","v":" "},"",{"$f":"IF(IFERROR(VLOOKUP(N$5&A15,计划!B:H,7,0),\"\")=0,\"\",IFERROR(VLOOKUP(N$5&A15,计划!B:H,7,0),\"\"))","v":""},{"$f":"IF(IFERROR(VLOOKUP($N$5&A15,计划!B:I,8,0),\"\")=0,\"\",IFERROR(VLOOKUP($N$5&A15,计划!B:I,8,0),\"\"))","v":""},{"$f":"IF(IFERROR(VLOOKUP($N$5&A15,计划!B:J,9,0),\"\")=0,\"\",IFERROR(VLOOKUP($N$5&A15,计划!B:J,9,0),\"\"))","v":""},{"$f":"IF(IFERROR(VLOOKUP($N$5&A15,计划!B:K,10,0),\"\")=0,\"\",IFERROR(VLOOKUP($N$5&A15,计划!B:K,10,0),\"\"))","v":""}]
["12",{"$f":"IFERROR(VLOOKUP(N$5&A16,计划!B:E,4,0),\"\")","v":""},{"$f":"IFERROR(VLOOKUP(N$5&A16,计划!B:F,5,0),\"\")","v":""},{"$f":"IFERROR(VLOOKUP(B16,课程代码!B:E,4,0),\"\")","v":""},{"$f":"IFERROR(VLOOKUP($N$5&A16,计划!B:G,6,0),\"\")","v":""},{"$f":"IFERROR(VLOOKUP(B16,IF({1,0},R:R,Q:Q),2,0),\"\")","v":""},"",{"$f":"IFERROR(IF(G16<>\"\",VLOOKUP($N$5&A16,计划!B:G,6,0),\"\")&\" \"&IF(I16<>\"\",VLOOKUP($N$5&A16,计划!B:G,6,0),\"\"),\"\")","v":" "},"",{"$f":"IF(IFERROR(VLOOKUP(N$5&A16,计划!B:H,7,0),\"\")=0,\"\",IFERROR(VLOOKUP(N$5&A16,计划!B:H,7,0),\"\"))","v":""},{"$f":"IF(IFERROR(VLOOKUP($N$5&A16,计划!B:I,8,0),\"\")=0,\"\",IFERROR(VLOOKUP($N$5&A16,计划!B:I,8,0),\"\"))","v":""},{"$f":"IF(IFERROR(VLOOKUP($N$5&A16,计划!B:J,9,0),\"\")=0,\"\",IFERROR(VLOOKUP($N$5&A16,计划!B:J,9,0),\"\"))","v":""},{"$f":"IF(IFERROR(VLOOKUP($N$5&A16,计划!B:K,10,0),\"\")=0,\"\",IFERROR(VLOOKUP($N$5&A16,计划!B:K,10,0),\"\"))","v":""}]
["13",{"$f":"IFERROR(VLOOKUP(N$5&A17,计划!B:E,4,0),\"\")","v":""},{"$f":"IFERROR(VLOOKUP(N$5&A17,计划!B:F,5,0),\"\")","v":""},{"$f":"IFERROR(VLOOKUP(B17,课程代码!B:E,4,0),\"\")","v":""},{"$f":"IFERROR(VLOOKUP($N$5&A17,计划!B:G,6,0),\"\")","v":""},{"$f":"IFERROR(VLOOKUP(B17,IF({1,0},R:R,Q:Q),2,0),\"\")","v":""},"",{"$f":"IFERROR(IF(G17<>\"\",VLOOKUP($N$5&A17,计划!B:G,6,0),\"\")&\" \"&IF(I17<>\"\",VLOOKUP($N$5&A17,计划!B:G,6,0),\"\"),\"\")","v":" "},"",{"$f":"IF(IFERROR(VLOOKUP(N$5&A17,计划!B:H,7,0),\"\")=0,\"\",IFERROR(VLOOKUP(N$5&A17,计划!B:H,7,0),\"\"))","v":""},{"$f":"IF(IFERROR(VLOOKUP($N$5&A17,计划!B:I,8,0),\"\")=0,\"\",IFERROR(VLOOKUP($N$5&A17,计划!B:I,8,0),\"\"))","v":""},{"$f":"IF(IFERROR(VLOOKUP($N$5&A17,计划!B:J,9,0),\"\")=0,\"\",IFERROR(VLOOKUP($N$5&A17,计划!B:J,9,0),\"\"))","v":""},{"$f":"IF(IFERROR(VLOOKUP($N$5&A17,计划!B:K,10,0),\"\")=0,\"\",IFERROR(VLOOKUP($N$5&A17,计划!B:K,10,0),\"\"))","v":""}]
["14",{"$f":"IFERROR(VLOOKUP(N$5&A18,计划!B:E,4,0),\"\")","v":""},{"$f":"IFERROR(VLOOKUP(N$5&A18,计划!B:F,5,0),\"\")","v":""},{"$f":"IFERROR(VLOOKUP(B18,课程代码!B:E,4,0),\"\")","v":""},{"$f":"IFERROR(VLOOKUP($N$5&A18,计划!B:G,6,0),\"\")","v":""},{"$f":"IFERROR(VLOOKUP(B18,IF({1,0},R:R,Q:Q),2,0),\"\")","v":""},"",{"$f":"IFERROR(IF(G18<>\"\",VLOOKUP($N$5&A18,计划!B:G,6,0),\"\")&\" \"&IF(I18<>\"\",VLOOKUP($N$5&A18,计划!B:G,6,0),\"\"),\"\")","v":" "},"",{"$f":"IF(IFERROR(VLOOKUP(N$5&A18,计划!B:H,7,0),\"\")=0,\"\",IFERROR(VLOOKUP(N$5&A18,计划!B:H,7,0),\"\"))","v":""},{"$f":"IF(IFERROR(VLOOKUP($N$5&A18,计划!B:I,8,0),\"\")=0,\"\",IFERROR(VLOOKUP($N$5&A18,计划!B:I,8,0),\"\"))","v":""},{"$f":"IF(IFERROR(VLOOKUP($N$5&A18,计划!B:J,9,0),\"\")=0,\"\",IFERROR(VLOOKUP($N$5&A18,计划!B:J,9,0),\"\"))","v":""},{"$f":"IF(IFERROR(VLOOKUP($N$5&A18,计划!B:K,10,0),\"\")=0,\"\",IFERROR(VLOOKUP($N$5&A18,计划!B:K,10,0),\"\"))","v":""}]
["15",{"$f":"IFERROR(VLOOKUP(N$5&A19,计划!B:E,4,0),\"\")","v":""},{"$f":"IFERROR(VLOOKUP(N$5&A19,计划!B:F,5,0),\"\")","v":""},{"$f":"IFERROR(VLOOKUP(B19,课程代码!B:E,4,0),\"\")","v":""},{"$f":"IFERROR(VLOOKUP($N$5&A19,计划!B:G,6,0),\"\")","v":""},{"$f":"IFERROR(VLOOKUP(B19,IF({1,0},R:R,Q:Q),2,0),\"\")","v":""},"",{"$f":"IFERROR(IF(G19<>\"\",VLOOKUP($N$5&A19,计划!B:G,6,0),\"\")&\" \"&IF(I19<>\"\",VLOOKUP($N$5&A19,计划!B:G,6,0),\"\"),\"\")","v":" "},"",{"$f":"IF(IFERROR(VLOOKUP(N$5&A19,计划!B:H,7,0),\"\")=0,\"\",IFERROR(VLOOKUP(N$5&A19,计划!B:H,7,0),\"\"))","v":""},{"$f":"IF(IFERROR(VLOOKUP($N$5&A19,计划!B:I,8,0),\"\")=0,\"\",IFERROR(VLOOKUP($N$5&A19,计划!B:I,8,0),\"\"))","v":""},{"$f":"IF(IFERROR(VLOOKUP($N$5&A19,计划!B:J,9,0),\"\")=0,\"\",IFERROR(VLOOKUP($N$5&A19,计划!B:J,9,0),\"\"))","v":""},{"$f":"IF(IFERROR(VLOOKUP($N$5&A19,计划!B:K,10,0),\"\")=0,\"\",IFERROR(VLOOKUP($N$5&A19,计划!B:K,10,0),\"\"))","v":""}]
["16",{"$f":"IFERROR(VLOOKUP(N$5&A20,计划!B:E,4,0),\"\")","v":""},{"$f":"IFERROR(VLOOKUP(N$5&A20,计划!B:F,5,0),\"\")","v":""},{"$f":"IFERROR(VLOOKUP(B20,课程代码!B:E,4,0),\"\")","v":""},{"$f":"IFERROR(VLOOKUP($N$5&A20,计划!B:G,6,0),\"\")","v":""},{"$f":"IFERROR(VLOOKUP(B20,IF({1,0},R:R,Q:Q),2,0),\"\")","v":""},"",{"$f":"IFERROR(IF(G20<>\"\",VLOOKUP($N$5&A20,计划!B:G,6,0),\"\")&\" \"&IF(I20<>\"\",VLOOKUP($N$5&A20,计划!B:G,6,0),\"\"),\"\")","v":" "},"",{"$f":"IF(IFERROR(VLOOKUP(N$5&A20,计划!B:H,7,0),\"\")=0,\"\",IFERROR(VLOOKUP(N$5&A20,计划!B:H,7,0),\"\"))","v":""},{"$f":"IF(IFERROR(VLOOKUP($N$5&A20,计划!B:I,8,0),\"\")=0,\"\",IFERROR(VLOOKUP($N$5&A20,计划!B:I,8,0),\"\"))","v":""},{"$f":"IF(IFERROR(VLOOKUP($N$5&A20,计划!B:J,9,0),\"\")=0,\"\",IFERROR(VLOOKUP($N$5&A20,计划!B:J,9,0),\"\"))","v":""},{"$f":"IF(IFERROR(VLOOKUP($N$5&A20,计划!B:K,10,0),\"\")=0,\"\",IFERROR(VLOOKUP($N$5&A20,计划!B:K,10,0),\"\"))","v":""}]
{"$rows_left_out":24}
{"sheet":"新旧计划","index":1,"n_rows":60,"n_cols":8,"rows_kept":60,"cut":false,"hidden":false,"merged":[]}
["序号","课程代码","课程名称","旧课程代码","旧课程名称","学分","升降","课程调整及学分变动情况"]
[1,2160,"流体力学","03347","流体力学",null,null,"替换原03347"]
[2,4624,"工程经济学","02194","工程经济",null,null,"替换原02194"]
[3,8119,"管理会计","00157","管理会计(一)",5,"↓5","替换原00157，学分降为5"]
[4,10993,"工程数学（线性代数、概率论与数理统计）","06268","工程数学",6,"↓6","替换原06268，学分降为6"]
[5,13000,"英语(专升本)","00015","英语(二)",7,"↓7","替换原00015，学分降为7"]
[6,13005,"软件工程","02333","软件工程",null,null,"替换原02333"]
[7,13013,"高级语言程序设计","00342","高级语言程序设计(一)",4,"↑4","替换原00342，学分升为4"]
[8,13124,"英语(专)","00012","英语(一)",null,null,"替换原00012"]
[9,13125,"高等数学(经管类)","00020","高等数学(一)",null,null,"替换原00020"]
[10,13129,"英汉互译","00087","英语翻译",null,null,"替换原00087"]
[11,13130,"国际贸易实务","00090","国际贸易实务(一)",3,"↓3","替换原00090，学分降为3"]
[12,13135,"西方经济学（中级）","00139","西方经济学",null,null,"替换原00139"]
[13,13136,"人力资源管理(初级)","00147","人力资源管理(一)",null,null,"替换原00147"]
[14,13137,"质量管理","00153","质量管理(一)",null,null,"替换原00153"]
[15,13138,"财务会计（初级）","00155","中级财务会计",6,"↓6","替换原00155，学分降为6"]
[16,13139,"成本会计","00156","成本会计",3,"↓3","替换原00156，学分降为3"]
[17,13140,"财务会计（中级）","00159","高级财务会计",null,null,"替换原00159"]
[18,13141,"财务报表分析","00161","财务报表分析(一)",null,null,"替换原00161"]
[19,13142,"广告学","00181","广告学(一)",null,null,"替换原00181"]
{"$rows_left_out":41}
{"sheet":"专业","index":2,"n_rows":148,"n_cols":6,"rows_kept":148,"cut":false,"hidden":false,"merged":[]}
["序号","专业代码","专业名称","学分","备注","专业代码"]
[1,"610205","610205软件技术(专科)",72,"不少于5门,不低于22学分","610205"]
[2,"A020105","A020105金融(专科)",null,null,"A020105"]
[3,"A020109","A020109国际贸易(专科)",null,null,"A020109"]
[4,"A020201","A020201工商企业管理(专科)",70,"不少于6门，不低于29学分","A020201"]
[5,"A020203","A020203会计(专科)",null,null,"A020203"]
[6,"A020205","A020205人力资源管理(专科)",null,null,"A020205"]
[7,"A020207","A020207市场营销(专科)",70,"不少于6门，不低于30学分","A020207"]
[8,"A020209","A020209旅游管理(专科)",68,"不少于6门,不低于30学分","A020209"]
[9,"A020215","A020215电子商务(移动方向) (专科)",70,"不少于6门，不低于29学分","A020215"]
[10,"A020228","A020228物流管理(专科)",null,null,"A020228"]
[11,"A020271","A020271公共事业管理(专科)",null,null,"A020271"]
[12,"A020272","A020272经济信息管理(专科)",null,null,"A020272"]
[13,"A020313","A020313销售管理(专科)",70,"不少于5门，不低于24学分","A020313"]
[14,"A020319","A020319中小企业经营管理(专科)",null,null,"A020319"]
[15,"A030104","A030104经济法学(专科)",null,null,"A030104"]
[16,"A030301","A030301行政管理(专科)",null,"不少于6门，不低于23学分","A030301"]
[17,"A040101","A040101学前教育(专科)",70,"不少于6门,不低于26学分","A040101"]
[18,"A040103","A040103小学教育(专科)",null,null,"A040103"]
[19,"A050102","A050102秘书(专科)",null,null,"A050102"]
{"$rows_left_out":129}
{"sheet":"计划","index":3,"n_rows":3386,"n_cols":16,"rows_kept":3386,"cut":false,"hidden":false,"merged":[]}
["序号","专课序号","专业代码","专业名称","课程代码","课程名称","学分","备注","置换1","置换2","置换3"]
[1,"B08080901","B080809","交通土建工程(独立本科段)","03708","中国近现代史纲要",2,null,null,null,null,null,"必"]
[2,"B08080902","B080809","交通土建工程(独立本科段)","03709","马克思主义基本原理概论",4,null,null,null,null,null,"必"]
[3,"B08080903","B080809","交通土建工程(独立本科段)","02409","桥梁工程",8,7325,"07325",null,null,null,"必"]
[4,"B08080904","B080809","交通土建工程(独立本科段)","02410","桥梁工程(实践)",2,7335,"07335",null,null,null,"必"]
[5,"B08080905","B080809","交通土建工程(独立本科段)","06086","工程监理",5,7330,"07330",null,null,null,"必"]
[6,"B08080906","B080809","交通土建工程(独立本科段)","06087","工程项目管理",5,7331,"07331",null,null,null,"必"]
[7,"B08080907","B080809","交通土建工程(独立本科段)","06285","交通工程经济分析",5,7329,"07329",null,null,null,"必"]
[8,"B08080908","B080809","交通土建工程(独立本科段)","06286","桥涵水文",5,7326,"07326",null,null,null,"必"]
[9,"B08080909","B080809","交通土建工程(独立本科段)","06287","结构设计原理(二)",5,7324,"07324",null,null,null,"必"]
[10,"B08080910","B080809","交通土建工程(独立本科段)","06289","工程招投标与合同管理",5,7328,"07328",null,null,null,"必"]
[11,"B08080911","B080809","交通土建工程(独立本科段)"," ","以下选考课程"," "," "]
[12,"B08080912","B080809","交通土建工程(独立本科段)","00365","交通工程",8,"选考课程必要条件"]
[13,"B08080913","B080809","交通土建工程(独立本科段)","06167","工程机械",4,"不少于4门,7327","07327"]
[14,"B08080914","B080809","交通土建工程(独立本科段)","10993","工程数学（线性代数、概率论与数理统计）","6/10","不低于24学分,7307，原06268","07307","06268",null,null,null,10993,"工程数学（线性代数、概率论与数理统计）",6]
[15,"B08080915","B080809","交通土建工程(独立本科段)","06269","工程应用英语",10,"毕业总学分70,7322","07322"]
[16,"B08080916","B080809","交通土建工程(独立本科段)","06288","公路工程CAD",4,7323,"07323"]
[17,"B08080917","B080809","交通土建工程(独立本科段)","06302","现代施工技术",5]
[18,"B08080918","B080809","交通土建工程(独立本科段)","07138","工程造价与管理",5]
[19,"B08080919","B080809","交通土建工程(独立本科段)"," ","以下是毕业环节必须"," "," "]
{"$rows_left_out":3367}
{"sheet":"课程代码","index":4,"n_rows":1837,"n_cols":5,"rows_kept":1837,"cut":false,"hidden":false,"merged":[]}
["序号","课程代码","课程名称","课程代码","类别"]
[1,"00001","马克思主义哲学原理","00001","国考"]
[2,"00002","邓小平理论概论","00002","国考"]
[3,"00003","法律基础与思想道德修养","00003","国考"]
[4,"00004","毛泽东思想概论","00004","国考"]
[5,"00005","马克思主义政治经济学原理","00005","国考"]
[6,"00009","政治经济学(财经类)","00009","国考"]
[7,"00010","大学语文","00010","国考"]
[8,"00012","英语(一)","00012","国考"]
[9,"00015","英语(二)","00015","国考"]
[10,"00018","计算机应用基础","00018","国考"]
[11,"00019","计算机应用基础(实践)","00019"]
[12,"00020","高等数学(一)","00020","国考"]
[13,"00021","高等数学(二)","00021","国考"]
[14,"00022","高等数学(工专)","00022","国考"]
[15,"00023","高等数学(工本)","00023","国考"]
[16,"00024","普通逻辑","00024","国考"]
[17,"00031","心理学","00031","国考"]
[18,"00034","社会学概论","00034","国考"]
[19,"00037","美学","00037","国考"]
{"$rows_left_out":1818}
{"sheet":"Sheet1","index":5,"n_rows":28,"n_cols":11,"rows_kept":28,"cut":false,"hidden":false,"merged":[[0,0,0,10],[1,5,1,6],[1,8,1,9],[1,0,2,0],[9,0,10,0],[1,4,2,4],[9,4,10,4],[1,10,2,10],[18,0,19,0],[20,0,21,0],[1,1,2,1],[1,2,2,2],[1,3,2,3],[14,10,23,10],[18,4,19,4],[20,4,21,4],[1,7,2,7],[9,7,10,7],[18,7,19,7],[20,7,21,7]]}
["030503思想政治教育(本)\n湖南省 福建省 自学考试专业开考计划对比"]
["序号","课程代码","课程名称","学分","必选","湖南",null,"必选","福建",null,"备注"]
[null,null,null,null,null,"4月","10月",null,"4月","10月"]
["01","13000","英语(专升本)",7,"必",null,null,"必",4,4,"湖南00015替代"]
["02","14008","马克思主义哲学概论",6,"必",1,1,"必",1,1,"  "]
["03","14009","马克思主义政治经济学概论",6,"必",2,2,"必",2,2,"  "]
["04","13933","科学社会主义概论",6,"必",3,3,"必",3,3,"  "]
["05","07082","马克思主义原著选读",4,"必",4,4,"必",1,2,"  "]
["06","14007","马克思主义发展史",5,"必",1,null,"必",1,1,"  "]
["07","14279","思想政治教育学",4,"必",2,null,"必",1,1,"  "]
[null,"14280","思想政治教育学(实践)",2,null,null,null,null,null,null,""]
["08","07080","中国共产党史",6,"必",3,3,"必",2,2,"  "]
["09","14690","中国共产党思想政治教育史",4,"必",4,4,"必",3,3,"  "]
[]
[10,"00315","当代中国政治制度",6,"选",2,2,"无",null,null,"湖南：选考课条件:\n不少于4门,不得低于20学分.毕业总学分70.\n\n福建：\n1.本专业考试课程14门，总学分72学分。\n2.课程“英语(专升本)（13000）”（7学分）可以用两门“笔试”课程学分顶替，要求达到7学分及以上。"]
["13","06408","当代世界经济与政治",6,"选",null,1,"选",2,4]
["14","14278","思想政治教育心理学",4,"选",null,2,"选",3,3]
["15","14184","社会思潮与青年教育",4,"选",null,3,"选",2,1]
["16","14068","企业思想政治工作",3,"选",null,4,"选",4,4]
[null,"14069","企业思想政治工作(实践)",1]
{"$rows_left_out":8}